Target
Kallikrein-5
Ligand
BDBM56361
Substrate
Meas. Tech.
Kallikrein 5 1536 HTS Dose Response Confirmation
IC50
50000±n/a nM
Citation
 PubChem, PC Kallikrein 5 1536 HTS Dose Response Confirmation PubChem Bioassay (2008)[AID] 
Target
Name:
Kallikrein-5
Synonyms:
KLK5 Kallikrein 5 kallikrein-related peptidase 5 preproprotein
Type:
PROTEIN
Mol. Mass.:
32031.72
Organism:
Homo sapiens (Human)
Description:
EBI_12584
Residue:
293
  
Inhibitor
Name:
BDBM56361
Synonyms:
(3Z)-3-[[(1-hydroxy-2-methylpropan-2-yl)amino]methylidene]-1H-indol-2-one (3Z)-3-[[(2-methyl-1-oxidanyl-propan-2-yl)amino]methylidene]-1H-indol-2-one MLS000530406 cid_5336035
Type:
Small organic molecule
Emp. Form.:
C13H16N2O2
Mol. Mass.:
232.2783
SMILES:
CC(C)(CO)N=CC1C(=O)Nc2ccccc12
: