Target
Kallikrein-5
Ligand
BDBM56583
Substrate
Meas. Tech.
Kallikrein 5 1536 HTS Dose Response Confirmation
IC50
50000±n/a nM
Citation
 PubChem, PC Kallikrein 5 1536 HTS Dose Response Confirmation PubChem Bioassay (2008)[AID] 
Target
Name:
Kallikrein-5
Synonyms:
KLK5 Kallikrein 5 kallikrein-related peptidase 5 preproprotein
Type:
PROTEIN
Mol. Mass.:
32031.72
Organism:
Homo sapiens (Human)
Description:
EBI_12584
Residue:
293
  
Inhibitor
Name:
BDBM56583
Synonyms:
2-(5-amino-3-methyl-1-phenyl-4-pyrazolyl)-1,1,1,3,3,3-hexafluoro-2-propanol 2-(5-amino-3-methyl-1-phenylpyrazol-4-yl)-1,1,1,3,3,3-hexafluoropropan-2-ol MLS000402391 cid_2322999
Type:
Small organic molecule
Emp. Form.:
C13H11F6N3O
Mol. Mass.:
339.2364
SMILES:
Cc1nn(c(N)c1C(O)(C(F)(F)F)C(F)(F)F)-c1ccccc1
: