Target
Streptokinase A
Ligand
BDBM57528
Substrate
Meas. Tech.
Absorbance Microorganism-Based Dose Response HTS to Identify Inhibitors of Streptokinase Expression
EC50
150000±n/a nM
Citation
 PubChem, PC Absorbance Microorganism-Based Dose Response HTS to Identify Inhibitors of Streptokinase Expression PubChem Bioassay (2009)[AID] 
Target
Name:
Streptokinase A
Synonyms:
STRP_STRP1 streptokinase A precursor
Type:
Enzyme Catalytic Domain
Mol. Mass.:
49924.80
Organism:
Streptococcus pyogenes M1 GAS
Description:
gi_15675770
Residue:
440
  
Inhibitor
Name:
BDBM57528
Synonyms:
2-furancarboxylic acid [3-[[[4-anilino-6-(4-morpholinyl)-1,3,5-triazin-2-yl]hydrazinylidene]methyl]phenyl] ester MLS000560358 [3-[[(4-anilino-6-morpholin-4-yl-1,3,5-triazin-2-yl)hydrazinylidene]methyl]phenyl] furan-2-carboxylate cid_3111016 | furan-2-carboxylic acid [3-[[(4-anilino-6-morpholino-s-triazin-2-yl)hydrazono]methyl]phenyl] ester
Type:
Small organic molecule
Emp. Form.:
C25H23N7O4
Mol. Mass.:
485.4946
SMILES:
O=C(Oc1cccc(CN=Nc2nc(Nc3ccccc3)nc(n2)N2CCOCC2)c1)c1ccco1
: