Target
Large T antigen
Ligand
BDBM58948
Substrate
Meas. Tech.
Identification of SV40 T antigen inhibitors: Cytotoxicity screen of selected hits
EC50
>50000±n/a nM
Citation
 PubChem, PC Identification of SV40 T antigen inhibitors: Cytotoxicity screen of selected hits PubChem Bioassay (2009)[AID] 
Target
Name:
Large T antigen
Synonyms:
LT LT_SV40
Type:
Enzyme Catalytic Domain
Mol. Mass.:
81575.54
Organism:
Simian virus 40
Description:
P03070
Residue:
708
  
Inhibitor
Name:
BDBM58948
Synonyms:
4-[[4-(2-oxolanylmethylamino)-2-quinazolinyl]amino]phenol;hydrochloride 4-[[4-(tetrahydrofurfurylamino)quinazolin-2-yl]amino]phenol;hydrochloride MLS000026780 cid_2953078
Type:
Small organic molecule
Emp. Form.:
C19H20N4O2
Mol. Mass.:
336.3877
SMILES:
Oc1ccc(Nc2nc(NCC3CCCO3)c3ccccc3n2)cc1
: