Target
Sodium channel protein type 9 subunit alpha
Ligand
BDBM268532
Substrate
Meas. Tech.
Electrophysiological Assay (EP) (In Vitro Assay)
pH
7.2±n/a
IC50
3.00±n/a nM
Comments
extracted
Citation
 Bichler, PRChowdhury, SDecker, SMDehnhardt, CMFocken, TGrimwood, MEHemeon, IWSafina, BSheng, TSun, SWilson, MSZenova, AY Substituted triazolopyridines and methods of use thereof US Patent  US9550775 Publication Date 1/24/2017 
Target
Name:
Sodium channel protein type 9 subunit alpha
Synonyms:
NENA Peripheral sodium channel 1 SCN9A_HUMAN Voltage-gated sodium channel subunit Nav1.7 hNE-Na
Type:
Protein
Mol. Mass.:
226375.97
Organism:
Homo sapiens (Human)
Description:
Q15858
Residue:
1988
  
Inhibitor
Name:
BDBM268532
Synonyms:
N-(7-((1s,3s)-adamantan-1-ylmethoxy)-6-cyclopropyl-[1,2,4]triazolo[4,3-a]pyridin-3-yl)cyclopropanesulfonamide | US9550775, 56
Type:
Small organic molecule
Emp. Form.:
C23H30N4O3S
Mol. Mass.:
442.574
SMILES:
O=S(=O)(Nc1nnc2cc(OCC34CC5CC(CC(C5)C3)C4)c(cn12)C1CC1)C1CC1
: