Target
Cyclin-dependent kinase 1
Ligand
BDBM59104
Substrate
Meas. Tech.
In Vitro Kinase Assay
pH
7.2±0
IC50
500±0.0 nM
Citation
 Wan, YHur, WCho, CYLiu, YAdrian, FJLozach, OBach, SMayer, TFabbro, DMeijer, LGray, NS Synthesis and target identification of hymenialdisine analogs. Chem Biol 11:247-59 (2004)  
Target
Name:
Cyclin-dependent kinase 1
Synonyms:
CDC2 CDK1 CDKN1 Cell division protein kinase 1 P34CDC2 | p34 protein kinase
Type:
Enzyme Subunit
Mol. Mass.:
34101.08
Organism:
Homo sapiens (Human)
Description:
P06493
Residue:
297
  
Inhibitor
Name:
BDBM59104
Synonyms:
Hymenialdisine, 18
Type:
Small organic molecule
Emp. Form.:
C12H11Br2N5O2
Mol. Mass.:
417.056
SMILES:
CC1CC(=C2NC(N)=NC2=O)c2c(Br)c(Br)[nH]c2C(=O)N1
: