Target
Cyclin-dependent kinase 1
Ligand
BDBM59111
Substrate
Meas. Tech.
In Vitro Kinase Assay
pH
7.2±0
IC50
3200±0.0 nM
Citation
 Wan, YHur, WCho, CYLiu, YAdrian, FJLozach, OBach, SMayer, TFabbro, DMeijer, LGray, NS Synthesis and target identification of hymenialdisine analogs. Chem Biol 11:247-59 (2004)  
Target
Name:
Cyclin-dependent kinase 1
Synonyms:
CDC2 CDK1 CDKN1 Cell division protein kinase 1 P34CDC2 | p34 protein kinase
Type:
Enzyme Subunit
Mol. Mass.:
34101.08
Organism:
Homo sapiens (Human)
Description:
P06493
Residue:
297
  
Inhibitor
Name:
BDBM59111
Synonyms:
Hymenialdisine, 27f
Type:
Small organic molecule
Emp. Form.:
C15H12N6O4
Mol. Mass.:
340.2936
SMILES:
NC1=NC(=O)C(N1)=C1CCNC(=O)c2[nH]c3ccc(cc3c12)N(=O)=O
: