Target
Cyclin-dependent kinase 1
Ligand
BDBM59149
Substrate
Meas. Tech.
In Vitro Kinase Assay
pH
7.2±0
IC50
1.3e+3±n/a nM
Citation
 Wan, YHur, WCho, CYLiu, YAdrian, FJLozach, OBach, SMayer, TFabbro, DMeijer, LGray, NS Synthesis and target identification of hymenialdisine analogs. Chem Biol 11:247-59 (2004)  
Target
Name:
Cyclin-dependent kinase 1
Synonyms:
CDC2 CDK1 CDKN1 Cell division protein kinase 1 P34CDC2 | p34 protein kinase
Type:
Enzyme Subunit
Mol. Mass.:
34101.08
Organism:
Homo sapiens (Human)
Description:
P06493
Residue:
297
  
Inhibitor
Name:
BDBM59149
Synonyms:
Hymenialdisine, 28v
Type:
Small organic molecule
Emp. Form.:
C18H16FN5O3S
Mol. Mass.:
401.415
SMILES:
NS(=O)(=O)c1ccc(NN=C2CCNC(=O)c3[nH]c4ccc(F)cc4c23)cc1
: