Target
Alkaline phosphatase, tissue-nonspecific isozyme
Ligand
BDBM59286
Substrate
Meas. Tech.
uHTS identification of compounds activating TNAP in the absence of phosphate acceptor performed in luminescent assay
EC50
79230±n/a nM
Citation
 PubChem, PC uHTS identification of compounds activating TNAP in the absence of phosphate acceptor performed in luminescent assay PubChem Bioassay (2009)[AID] 
Target
Name:
Alkaline phosphatase, tissue-nonspecific isozyme
Synonyms:
ALPL tissue-nonspecific alkaline phosphatase precursor
Type:
PROTEIN
Mol. Mass.:
57306.17
Organism:
Homo sapiens (Human)
Description:
ChEMBL_1448917
Residue:
524
  
Inhibitor
Name:
BDBM59286
Synonyms:
1-[(4-tert-butylbenzoyl)amino]-3-sec-butyl-thiourea 1-butan-2-yl-3-[(4-tert-butylphenyl)carbonylamino]thiourea MLS000580190 SMR000199721 | cid_2954257
Type:
Small organic molecule
Emp. Form.:
C16H25N3OS
Mol. Mass.:
307.454
SMILES:
CCC(C)NC(=S)NNC(=O)c1ccc(cc1)C(C)(C)C
: