Target
Nucleotide-binding oligomerization domain-containing protein 1
Ligand
BDBM54254
Substrate
Meas. Tech.
uHTS luminescence assay for the identification of compounds that inhibit NOD1
EC50
20000±n/a nM
Citation
 PubChem, PC uHTS luminescence assay for the identification of compounds that inhibit NOD1 PubChem Bioassay (2010)[AID] 
Target
Name:
Nucleotide-binding oligomerization domain-containing protein 1
Synonyms:
CARD4 NOD1_HUMAN | nucleotide-binding oligomerization domain containing 1
Type:
Enzyme Catalytic Domain
Mol. Mass.:
107699.03
Organism:
Homo sapiens (Human)
Description:
gi_5174617
Residue:
953
  
Inhibitor
Name:
BDBM54254
Synonyms:
(E)-2-(1H-benzimidazol-2-yl)-3-(3-chlorophenyl)-1-phenyl-2-propen-1-one (E)-2-(1H-benzimidazol-2-yl)-3-(3-chlorophenyl)-1-phenylprop-2-en-1-one SMR000259409 | cid_6122140
Type:
Small organic molecule
Emp. Form.:
C22H15ClN2O
Mol. Mass.:
358.82
SMILES:
Clc1cccc(\C=C(\C(=O)c2ccccc2)c2nc3ccccc3[nH]2)c1
: