Target
M17 leucyl aminopeptidase
Ligand
BDBM41213
Substrate
Meas. Tech.
Inhibitors of Plasmodium falciparum M17- Family Leucine Aminopeptidase (M17LAP)
IC50
14700±n/a nM
Citation
 PubChem, PC Inhibitors of Plasmodium falciparum M17- Family Leucine Aminopeptidase (M17LAP) PubChem Bioassay (2009)[AID] 
Target
Name:
M17 leucyl aminopeptidase
Synonyms:
leucine aminopeptidase
Type:
Enzyme Catalytic Domain
Mol. Mass.:
67834.32
Organism:
Plasmodium falciparum 3D7
Description:
gi_124809582
Residue:
605
  
Inhibitor
Name:
BDBM41213
Synonyms:
MLS000037313 N-[4-[2-[(4-prop-2-enyl-5-thiophen-2-yl-1,2,4-triazol-3-yl)sulfanyl]acetyl]phenyl]benzenesulfonamide N-[4-[2-[[4-allyl-5-(2-thienyl)-1,2,4-triazol-3-yl]thio]acetyl]phenyl]benzenesulfonamide cid_660594
Type:
Small organic molecule
Emp. Form.:
C23H20N4O3S3
Mol. Mass.:
496.625
SMILES:
C=CCn1c(SCC(=O)c2ccc(NS(=O)(=O)c3ccccc3)cc2)nnc1-c1cccs1
: