Target
Dual specificity protein phosphatase 3
Ligand
BDBM46207
Substrate
Meas. Tech.
uHTS absorbance assay for the identification of compounds that inhibit VHR1.
IC50
6720±n/a nM
Citation
 PubChem, PC uHTS absorbance assay for the identification of compounds that inhibit VHR1. PubChem Bioassay (2009)[AID] 
Target
Name:
Dual specificity protein phosphatase 3
Synonyms:
DUS3_HUMAN Dual specificity protein phosphatase (VHR) Dual specificity protein phosphatase VHR Tyrosine-protein phosphatase non-receptor type 1 | VHR
Type:
Hydrolase
Mol. Mass.:
20480.58
Organism:
Homo sapiens (Human)
Description:
Residue:
185
  
Inhibitor
Name:
BDBM46207
Synonyms:
4-[[5-(4-bromophenyl)-2-furoyl]thiocarbamoylamino]benzoic acid 4-[[5-(4-bromophenyl)furan-2-yl]carbonylcarbamothioylamino]benzoic acid MLS-0383777.0001 | cid_1328767
Type:
Small organic molecule
Emp. Form.:
C19H13BrN2O4S
Mol. Mass.:
445.287
SMILES:
OC(=O)c1ccc(NC(=S)NC(=O)c2ccc(o2)-c2ccc(Br)cc2)cc1
: