Target
SUMO-activating enzyme subunit 1
Ligand
BDBM50572
Substrate
Meas. Tech.
uHTS HTRF assay for identification of inhibitors of SUMOylation
IC50
17090±n/a nM
Citation
 PubChem, PC uHTS HTRF assay for identification of inhibitors of SUMOylation PubChem Bioassay (2010)[AID] 
Target
Name:
SUMO-activating enzyme subunit 1
Synonyms:
AOS1 SAE1_HUMAN SUMO-activating enzyme subunit 1 (SAE1) UBLE1A
Type:
Enzyme Catalytic Domain
Mol. Mass.:
38440.84
Organism:
Homo sapiens (Human)
Description:
gi_17390638
Residue:
346
  
Inhibitor
Name:
BDBM50572
Synonyms:
(3S,4S)-5-[(3S,4S)-4,10-dihydroxy-7,9-dimethoxy-3-methyl-3,4-dihydro-1H-benz[g]isochromen-5-yl]-7,9-dimethoxy-3-methyl-3,4-dihydro-1H-benz[g]isochromene-4,10-diol (3S,4S)-5-[(3S,4S)-4,10-dihydroxy-7,9-dimethoxy-3-methyl-3,4-dihydro-1H-benzo[g]isochromen-5-yl]-7,9-dimethoxy-3-methyl-3,4-dihydro-1H-benzo[g]isochromene-4,10-diol MLS000876833 cid_10257591
Type:
Small organic molecule
Emp. Form.:
C32H34O10
Mol. Mass.:
578.6064
SMILES:
COc1cc(OC)c2c(O)c3CO[C@@H](C)[C@@H](O)c3c(-c3c4[C@H](O)[C@H](C)OCc4c(O)c4c(OC)cc(OC)cc34)c2c1
: