Target
Eukaryotic translation initiation factor 4H
Ligand
BDBM61354
Substrate
Meas. Tech.
uHTS fluorescence polarization assay for the identification of translation initiation inhibitors (eIF4H)
IC50
100000±n/a nM
Citation
 PubChem, PC uHTS fluorescence polarization assay for the identification of translation initiation inhibitors (eIF4H) PubChem Bioassay (2009)[AID] 
Target
Name:
Eukaryotic translation initiation factor 4H
Synonyms:
EIF4H KIAA0038 WSCR1
Type:
Enzyme Catalytic Domain
Mol. Mass.:
27385.24
Organism:
Homo sapiens (Human)
Description:
Q15056
Residue:
248
  
Inhibitor
Name:
BDBM61354
Synonyms:
2-(3-methyl-1-pyridin-1-iumyl)-1-phenylethanone;bromide 2-(3-methylpyridin-1-ium-1-yl)-1-phenylethanone;bromide MLS001195138 cid_12247929
Type:
Small organic molecule
Emp. Form.:
C14H14NO
Mol. Mass.:
212.2665
SMILES:
Cc1ccc[n+](CC(=O)c2ccccc2)c1
: