Target
Eukaryotic translation initiation factor 4H
Ligand
BDBM61242
Substrate
Meas. Tech.
uHTS fluorescence polarization assay for the identification of translation initiation inhibitors (eIF4H)
IC50
4815±n/a nM
Citation
 PubChem, PC uHTS fluorescence polarization assay for the identification of translation initiation inhibitors (eIF4H) PubChem Bioassay (2009)[AID] 
Target
Name:
Eukaryotic translation initiation factor 4H
Synonyms:
EIF4H KIAA0038 WSCR1
Type:
Enzyme Catalytic Domain
Mol. Mass.:
27385.24
Organism:
Homo sapiens (Human)
Description:
Q15056
Residue:
248
  
Inhibitor
Name:
BDBM61242
Synonyms:
4-methyl-N-[5-[2-oxidanylidene-2-[2-[(Z)-(3-oxidanyl-4-oxidanylidene-cyclohexa-2,5-dien-1-ylidene)methyl]hydrazinyl]ethyl]-1,3,4-thiadiazol-2-yl]benzamide N-(5-{2-[(2E)-2-(3,4-dihydroxybenzylidene)hydrazino]-2-oxoethyl}-1,3,4-thiadiazol-2-yl)-4-methylbenzamide N-[5-[2-[N'-[(Z)-(3-hydroxy-4-keto-cyclohexa-2,5-dien-1-ylidene)methyl]hydrazino]-2-keto-ethyl]-1,3,4-thiadiazol-2-yl]-4-methyl-benzamide SMR000554605 | cid_24762085
Type:
Small organic molecule
Emp. Form.:
C19H17N5O4S
Mol. Mass.:
411.434
SMILES:
Cc1ccc(cc1)C(=O)Nc1nnc(CC(=O)NN=Cc2ccc(O)c(O)c2)s1
: