Target
Eukaryotic translation initiation factor 4H
Ligand
BDBM61374
Substrate
Meas. Tech.
uHTS fluorescence polarization assay for the identification of translation initiation inhibitors (eIF4H)
IC50
12010±n/a nM
Citation
 PubChem, PC uHTS fluorescence polarization assay for the identification of translation initiation inhibitors (eIF4H) PubChem Bioassay (2009)[AID] 
Target
Name:
Eukaryotic translation initiation factor 4H
Synonyms:
EIF4H KIAA0038 WSCR1
Type:
Enzyme Catalytic Domain
Mol. Mass.:
27385.24
Organism:
Homo sapiens (Human)
Description:
Q15056
Residue:
248
  
Inhibitor
Name:
BDBM61374
Synonyms:
MLS001095761 N-(3-acetylphenyl)-3-[6-(2-furfurylamino)-[1,2,4]triazolo[4,3-b]pyridazin-3-yl]propionamide N-(3-ethanoylphenyl)-3-[6-(furan-2-ylmethylamino)-[1,2,4]triazolo[4,3-b]pyridazin-3-yl]propanamide cid_20957099
Type:
Small organic molecule
Emp. Form.:
C21H20N6O3
Mol. Mass.:
404.4219
SMILES:
CC(=O)c1cccc(NC(=O)CCc2nnc3ccc(NCc4ccco4)nn23)c1
: