Target
Voltage-dependent N-type calcium channel subunit alpha-1B
Ligand
BDBM34524
Substrate
Meas. Tech.
Homogeneous Time-Resolved Fluorescence Resonance Energy Transfer (HTRF) Assay
IC50
16700±n/a nM
Citation
 PubChem, PC Homogeneous Time-Resolved Fluorescence Resonance Energy Transfer (HTRF) Assay PubChem Bioassay (2009)[AID] 
Target
Name:
Voltage-dependent N-type calcium channel subunit alpha-1B
Synonyms:
BIII CAC1B_HUMAN CACNA1B Calcium channel (Type N) Voltage-dependent N-type calcium channel subunit alpha-1B Voltage-gated N-type calcium channel alpha-1B subunit Voltage-gated calcium channel Voltage-gated calcium channel subunit alpha Cav2.2 ((alpha 1B, beta 1b, alpha 2 delta-1) | calcium channel, voltage-dependent, N type, alpha 1B subunit
Type:
Enzyme
Mol. Mass.:
262548.16
Organism:
Homo sapiens (Human)
Description:
Q00975
Residue:
2339
  
Inhibitor
Name:
BDBM34524
Synonyms:
2-[2-keto-2-[3-methyl-4-(m-tolyl)piperazino]ethyl]-4,6-dimethyl-isothiazolo[5,4-b]pyridin-3-one 4,6-dimethyl-2-[2-[3-methyl-4-(3-methylphenyl)piperazin-1-yl]-2-oxidanylidene-ethyl]-[1,2]thiazolo[5,4-b]pyridin-3-one MLS000118900 cid_5309798
Type:
Small organic molecule
Emp. Form.:
C22H26N4O2S
Mol. Mass.:
410.532
SMILES:
CC1CN(CCN1c1cccc(C)c1)C(=O)Cn1sc2nc(C)cc(C)c2c1=O
: