Target
Voltage-dependent N-type calcium channel subunit alpha-1B
Ligand
BDBM61728
Substrate
Meas. Tech.
Homogeneous Time-Resolved Fluorescence Resonance Energy Transfer (HTRF) Assay
IC50
11800±n/a nM
Citation
 PubChem, PC Homogeneous Time-Resolved Fluorescence Resonance Energy Transfer (HTRF) Assay PubChem Bioassay (2009)[AID] 
Target
Name:
Voltage-dependent N-type calcium channel subunit alpha-1B
Synonyms:
BIII CAC1B_HUMAN CACNA1B Calcium channel (Type N) Voltage-dependent N-type calcium channel subunit alpha-1B Voltage-gated N-type calcium channel alpha-1B subunit Voltage-gated calcium channel Voltage-gated calcium channel subunit alpha Cav2.2 ((alpha 1B, beta 1b, alpha 2 delta-1) | calcium channel, voltage-dependent, N type, alpha 1B subunit
Type:
Enzyme
Mol. Mass.:
262548.16
Organism:
Homo sapiens (Human)
Description:
Q00975
Residue:
2339
  
Inhibitor
Name:
BDBM61728
Synonyms:
MLS000830182 N-(4-oxidanylidenethieno[3,2-d][1,3]thiazin-2-yl)furan-2-carboxamide N-(4-oxo-4H-thieno[3,2-d][1,3]thiazin-2-yl)-2-furamide SMR000458103 | cid_2810061
Type:
Small organic molecule
Emp. Form.:
C11H6N2O3S2
Mol. Mass.:
278.307
SMILES:
O=C(Nc1nc2ccsc2c(=O)s1)c1ccco1
: