Target
Neuropeptide Y receptor type 1
Ligand
BDBM47421
Substrate
Meas. Tech.
Fluorescence-based counterscreen for agonists of NPY-Y2: cell-based high-throughput dose response assay for agonists of NPY-Y1.
EC50
>35430±n/a nM
Citation
 PubChem, PC Fluorescence-based counterscreen for agonists of NPY-Y2: cell-based high-throughput dose response assay for agonists of NPY-Y1. PubChem Bioassay (2009)[AID] 
Target
Name:
Neuropeptide Y receptor type 1
Synonyms:
NPY-Y1 NPY1R NPYR neuropeptide Y receptor Y1
Type:
Enzyme Catalytic Domain
Mol. Mass.:
44399.07
Organism:
Homo sapiens (Human)
Description:
NPY-Y1 NPY1R HUMAN::P25929
Residue:
384
  
Inhibitor
Name:
BDBM47421
Synonyms:
MLS000374912 N-(1-adamantylcarbamoyl)-2-chloro-acetamide N-[(1-adamantylamino)-oxomethyl]-2-chloroacetamide cid_2378425
Type:
Small organic molecule
Emp. Form.:
C13H19ClN2O2
Mol. Mass.:
270.755
SMILES:
[H]C12CC3([H])CC([H])(C1)CC(C2)(C3)NC(=O)NC(=O)CCl
: