Target
Free fatty acid receptor 2
Ligand
BDBM403979
Substrate
Meas. Tech.
BINDING ASSAY
EC50
600±n/a nM
Citation
 Hoveyda, HRSchils, DZoute, LParcq, J Substituted pyrrolidines as G-protein coupled receptor 43 agonists US Patent  US10017468 Publication Date 7/10/2018 
Target
Name:
Free fatty acid receptor 2
Synonyms:
FFA2 FFAR2_HUMAN GPCR43 | GPR43
Type:
PROTEIN
Mol. Mass.:
37156.44
Organism:
Homo sapiens (Human)
Description:
ChEMBL_1508993
Residue:
330
  
Inhibitor
Name:
BDBM403979
Synonyms:
(2S,5R)-5-(2-chlorophenyl)-1-(4-(2-(2-methoxyethoxy)pyridin-3-yl)benzoyl)pyrrolidine-2-carboxylic acid US10781171, Compound 239 | US11072582, Compound 239
Type:
Small organic molecule
Emp. Form.:
C26H25ClN2O5
Mol. Mass.:
480.94
SMILES:
COCCOc1ncccc1-c1ccc(cc1)C(=O)N1[C@@H](CC[C@@H]1c1ccccc1Cl)C(O)=O
: