Target
Bcl-2-like protein 1
Ligand
BDBM61870
Substrate
Meas. Tech.
Counterscreen for inhibitors of MCL1: fluorescence polarization-based biochemical high throughput dose response assay for inhibitors of BCL2-related protein, long isoform (BCLXL).
IC50
108803±n/a nM
Citation
 PubChem, PC Counterscreen for inhibitors of MCL1: fluorescence polarization-based biochemical high throughput dose response assay for inhibitors of BCL2-related protein, long isoform (BCLXL). PubChem Bioassay (2009)[AID] 
Target
Name:
Bcl-2-like protein 1
Synonyms:
Anti-apoptotic Bcl-2 protein Apoptosis regulator Bcl-X BCL2-like 1 isoform 1 BCL2L1 Bcl-2-like protein 1 (Bcl-XL) Bcl-xL/Bcl-2-binding component 3 Bcl2-antagonist of cell death (BAD)
Type:
Mitochondrion membrane; Single-pass membrane protein
Mol. Mass.:
26039.60
Organism:
Homo sapiens (Human)
Description:
Residue:
233
  
Inhibitor
Name:
BDBM61870
Synonyms:
(3-formylphenyl) (E)-3-(furan-2-yl)prop-2-enoate (E)-3-(2-furanyl)-2-propenoic acid (3-formylphenyl) ester MLS001183497 cid_5873671
Type:
Small organic molecule
Emp. Form.:
C14H10O4
Mol. Mass.:
242.2268
SMILES:
O=Cc1cccc(OC(=O)\C=C\c2ccco2)c1
: