Target
Neuropeptide Y receptor type 2
Ligand
BDBM61785
Substrate
Meas. Tech.
Fluorescence-based counterscreen for agonists of NPY-Y1: cell-based high-throughput dose response assay for agonists of NPY-Y2.
EC50
35430±n/a nM
Citation
 PubChem, PC Fluorescence-based counterscreen for agonists of NPY-Y1: cell-based high-throughput dose response assay for agonists of NPY-Y2. PubChem Bioassay (2009)[AID] 
Target
Name:
Neuropeptide Y receptor type 2
Synonyms:
NPY-Y2 NPY2-R NPY2R_HUMAN Y2 receptor | neuropeptide Y receptor Y2
Type:
Enzyme Catalytic Domain
Mol. Mass.:
42734.65
Organism:
Homo sapiens (Human)
Description:
NPY-Y2 NPY2R HUMAN::P49146
Residue:
381
  
Inhibitor
Name:
BDBM61785
Synonyms:
2-[4-(2-methoxyphenoxy)-3-nitro-phenyl]quinoxaline MLS000672134 cid_1288612
Type:
Small organic molecule
Emp. Form.:
C21H15N3O4
Mol. Mass.:
373.3615
SMILES:
COc1ccccc1Oc1ccc(cc1[N+]([O-])=O)-c1cnc2ccccc2n1
: