Target
Neuropeptides B/W receptor type 1
Ligand
BDBM62066
Substrate
Meas. Tech.
Fluorescence-based dose response cell-based high throughput screening assay to identify antagonists of the G-protein coupled receptor 7 (GPR7).
IC50
43807±n/a nM
Citation
 PubChem, PC Fluorescence-based dose response cell-based high throughput screening assay to identify antagonists of the G-protein coupled receptor 7 (GPR7). PubChem Bioassay (2010)[AID] 
Target
Name:
Neuropeptides B/W receptor type 1
Synonyms:
GPR7 NPBWR1 | neuropeptides B/W receptor 1
Type:
Enzyme Catalytic Domain
Mol. Mass.:
36111.82
Organism:
Homo sapiens (Human)
Description:
gi_119607128
Residue:
328
  
Inhibitor
Name:
BDBM62066
Synonyms:
2-(3-chloro-6-oxo-6a,7,8,9-tetrahydropyrido[3,2-e]pyrrolo[1,2-a]pyrazin-5(6H)-yl)-N-(2-ethylphenyl)acetamide SMR000029264 | cid_3237683
Type:
Small organic molecule
Emp. Form.:
C20H21ClN4O2
Mol. Mass.:
384.859
SMILES:
CCc1ccccc1NC(=O)CN1C(=O)C2CCCN2c2ncc(Cl)cc12
: