Target
Nucleotide-binding oligomerization domain-containing protein 2
Ligand
BDBM62296
Substrate
Meas. Tech.
SAR analysis of compounds that inhibit NOD2 revised
IC50
20000±n/a nM
Citation
 PubChem, PC SAR analysis of compounds that inhibit NOD2 revised PubChem Bioassay (2010)[AID] 
Target
Name:
Nucleotide-binding oligomerization domain-containing protein 2
Synonyms:
CARD15 IBD1 NOD2 Nucleotide-binding oligomerization domain-containing protein 2 | nucleotide-binding oligomerization domain containing 2
Type:
PROTEIN
Mol. Mass.:
115287.18
Organism:
Homo sapiens (Human)
Description:
ChEMBL_1454053
Residue:
1040
  
Inhibitor
Name:
BDBM62296
Synonyms:
2-(morpholin-4-ylcarbonylamino)-4,5,6,7-tetrahydro-1-benzothiophene-3-carboxylic acid 2-(morpholine-4-carbonylamino)-4,5,6,7-tetrahydrobenzothiophene-3-carboxylic acid MLS-0323733.0001 | cid_8070567
Type:
Small organic molecule
Emp. Form.:
C14H18N2O4S
Mol. Mass.:
310.369
SMILES:
OC(=O)c1c(NC(=O)N2CCOCC2)sc2CCCCc12
: