Target
Tumor necrosis factor
Ligand
BDBM62296
Substrate
Meas. Tech.
SAR analysis of inhibitors of TNFa specific NF-kB induction revised
IC50
>20000±n/a nM
Citation
 PubChem, PC SAR analysis of inhibitors of TNFa specific NF-kB induction revised PubChem Bioassay (2010)[AID] 
Target
Name:
Tumor necrosis factor
Synonyms:
Cachectin TNF-a TNFA TNFSF2 Tumor necrosis factor (TNFa) Tumor necrosis factor ligand superfamily member 2 Tumor necrosis factor, soluble form | tumor necrosis factor alpha
Type:
Enzyme
Mol. Mass.:
25645.11
Organism:
Homo sapiens (Human)
Description:
P01375
Residue:
233
  
Inhibitor
Name:
BDBM62296
Synonyms:
2-(morpholin-4-ylcarbonylamino)-4,5,6,7-tetrahydro-1-benzothiophene-3-carboxylic acid 2-(morpholine-4-carbonylamino)-4,5,6,7-tetrahydrobenzothiophene-3-carboxylic acid MLS-0323733.0001 | cid_8070567
Type:
Small organic molecule
Emp. Form.:
C14H18N2O4S
Mol. Mass.:
310.369
SMILES:
OC(=O)c1c(NC(=O)N2CCOCC2)sc2CCCCc12
: