Target
Sphingosine 1-phosphate receptor 5
Ligand
BDBM57614
Substrate
Meas. Tech.
Late stage counterscreen assay for S1P4 antagonists: Fluorescence dose response cell-based screening assay for antagonists of the Sphingosine 1-Phosphate Receptor 5 (S1P5)
IC50
1299±n/a nM
Citation
 PubChem, PC Late stage counterscreen assay for S1P4 antagonists: Fluorescence dose response cell-based screening assay for antagonists of the Sphingosine 1-Phosphate Receptor 5 (S1P5) PubChem Bioassay (2010)[AID] 
Target
Name:
Sphingosine 1-phosphate receptor 5
Synonyms:
EDG8 S1P5 S1PR5_HUMAN Sphingosine 1-phosphate receptor Edg-8
Type:
G Protein-Coupled Receptor (GPCR)
Mol. Mass.:
41796.42
Organism:
Homo sapiens (Human)
Description:
Residue:
398
  
Inhibitor
Name:
BDBM57614
Synonyms:
1-[3,5-bis(2,2,2-trifluoroethoxy)phenyl]-3-phenyl-urea 1-[3,5-bis[2,2,2-tris(fluoranyl)ethoxy]phenyl]-3-phenyl-urea SMR000260731 | cid_2328694
Type:
Small organic molecule
Emp. Form.:
C17H14F6N2O3
Mol. Mass.:
408.2951
SMILES:
FC(F)(F)COc1cc(NC(=O)Nc2ccccc2)cc(OCC(F)(F)F)c1
: