Target
Sphingosine 1-phosphate receptor 5
Ligand
BDBM62391
Substrate
Meas. Tech.
Late stage counterscreen assay for S1P4 antagonists: Fluorescence dose response cell-based screening assay for antagonists of the Sphingosine 1-Phosphate Receptor 5 (S1P5)
IC50
>25000±n/a nM
Citation
 PubChem, PC Late stage counterscreen assay for S1P4 antagonists: Fluorescence dose response cell-based screening assay for antagonists of the Sphingosine 1-Phosphate Receptor 5 (S1P5) PubChem Bioassay (2010)[AID] 
Target
Name:
Sphingosine 1-phosphate receptor 5
Synonyms:
EDG8 S1P5 S1PR5_HUMAN Sphingosine 1-phosphate receptor Edg-8
Type:
G Protein-Coupled Receptor (GPCR)
Mol. Mass.:
41796.42
Organism:
Homo sapiens (Human)
Description:
Residue:
398
  
Inhibitor
Name:
BDBM62391
Synonyms:
5-(2-chlorophenyl)-N-(2-ethyl-6-methyl-phenyl)-2-furamide 5-(2-chlorophenyl)-N-(2-ethyl-6-methylphenyl)-2-furancarboxamide SR-02000000235 cid_7275219
Type:
Small organic molecule
Emp. Form.:
C20H18ClNO2
Mol. Mass.:
339.815
SMILES:
CCc1cccc(C)c1NC(=O)c1ccc(o1)-c1ccccc1Cl
: