Target
Sphingosine 1-phosphate receptor 5
Ligand
BDBM62395
Substrate
Meas. Tech.
Late stage counterscreen assay for S1P4 antagonists: Fluorescence dose response cell-based screening assay for antagonists of the Sphingosine 1-Phosphate Receptor 5 (S1P5)
IC50
>25000±n/a nM
Citation
 PubChem, PC Late stage counterscreen assay for S1P4 antagonists: Fluorescence dose response cell-based screening assay for antagonists of the Sphingosine 1-Phosphate Receptor 5 (S1P5) PubChem Bioassay (2010)[AID] 
Target
Name:
Sphingosine 1-phosphate receptor 5
Synonyms:
EDG8 S1P5 S1PR5_HUMAN Sphingosine 1-phosphate receptor Edg-8
Type:
G Protein-Coupled Receptor (GPCR)
Mol. Mass.:
41796.42
Organism:
Homo sapiens (Human)
Description:
Residue:
398
  
Inhibitor
Name:
BDBM62395
Synonyms:
5-(3-chlorophenyl)-N-(2,6-dimethylphenyl)-2-furamide 5-(3-chlorophenyl)-N-(2,6-dimethylphenyl)furan-2-carboxamide SR-02000000239-1 | cid_878124
Type:
Small organic molecule
Emp. Form.:
C19H16ClNO2
Mol. Mass.:
325.789
SMILES:
Cc1cccc(C)c1NC(=O)c1ccc(o1)-c1cccc(Cl)c1
: