Target
Sphingosine 1-phosphate receptor 5
Ligand
BDBM62400
Substrate
Meas. Tech.
Late stage counterscreen assay for S1P4 antagonists: Fluorescence dose response cell-based screening assay for antagonists of the Sphingosine 1-Phosphate Receptor 5 (S1P5)
IC50
>25000±n/a nM
Citation
 PubChem, PC Late stage counterscreen assay for S1P4 antagonists: Fluorescence dose response cell-based screening assay for antagonists of the Sphingosine 1-Phosphate Receptor 5 (S1P5) PubChem Bioassay (2010)[AID] 
Target
Name:
Sphingosine 1-phosphate receptor 5
Synonyms:
EDG8 S1P5 S1PR5_HUMAN Sphingosine 1-phosphate receptor Edg-8
Type:
G Protein-Coupled Receptor (GPCR)
Mol. Mass.:
41796.42
Organism:
Homo sapiens (Human)
Description:
Residue:
398
  
Inhibitor
Name:
BDBM62400
Synonyms:
5-(2,5-dichlorophenyl)-N-(2,6-dimethoxyphenyl)-2-furamide 5-(2,5-dichlorophenyl)-N-(2,6-dimethoxyphenyl)furan-2-carboxamide SR-02000000244 cid_44607576
Type:
Small organic molecule
Emp. Form.:
C19H15Cl2NO4
Mol. Mass.:
392.233
SMILES:
COc1cccc(OC)c1NC(=O)c1ccc(o1)-c1cc(Cl)ccc1Cl
: