Target
Sphingosine 1-phosphate receptor 5
Ligand
BDBM62403
Substrate
Meas. Tech.
Late stage counterscreen assay for S1P4 antagonists: Fluorescence dose response cell-based screening assay for antagonists of the Sphingosine 1-Phosphate Receptor 5 (S1P5)
IC50
>25000±n/a nM
Citation
 PubChem, PC Late stage counterscreen assay for S1P4 antagonists: Fluorescence dose response cell-based screening assay for antagonists of the Sphingosine 1-Phosphate Receptor 5 (S1P5) PubChem Bioassay (2010)[AID] 
Target
Name:
Sphingosine 1-phosphate receptor 5
Synonyms:
EDG8 S1P5 S1PR5_HUMAN Sphingosine 1-phosphate receptor Edg-8
Type:
G Protein-Coupled Receptor (GPCR)
Mol. Mass.:
41796.42
Organism:
Homo sapiens (Human)
Description:
Residue:
398
  
Inhibitor
Name:
BDBM62403
Synonyms:
5-(2,5-dichlorophenyl)-N-(2,6-dimethyl-3-methylsulfonylphenyl)-2-furancarboxamide 5-(2,5-dichlorophenyl)-N-(3-mesyl-2,6-dimethyl-phenyl)-2-furamide SR-02000000247 cid_44607582
Type:
Small organic molecule
Emp. Form.:
C20H17Cl2NO4S
Mol. Mass.:
438.324
SMILES:
Cc1ccc(c(C)c1NC(=O)c1ccc(o1)-c1cc(Cl)ccc1Cl)S(C)(=O)=O
: