Target
Sphingosine 1-phosphate receptor 5
Ligand
BDBM62406
Substrate
Meas. Tech.
Late stage counterscreen assay for S1P4 antagonists: Fluorescence dose response cell-based screening assay for antagonists of the Sphingosine 1-Phosphate Receptor 5 (S1P5)
IC50
>25000±n/a nM
Citation
 PubChem, PC Late stage counterscreen assay for S1P4 antagonists: Fluorescence dose response cell-based screening assay for antagonists of the Sphingosine 1-Phosphate Receptor 5 (S1P5) PubChem Bioassay (2010)[AID] 
Target
Name:
Sphingosine 1-phosphate receptor 5
Synonyms:
EDG8 S1P5 S1PR5_HUMAN Sphingosine 1-phosphate receptor Edg-8
Type:
G Protein-Coupled Receptor (GPCR)
Mol. Mass.:
41796.42
Organism:
Homo sapiens (Human)
Description:
Residue:
398
  
Inhibitor
Name:
BDBM62406
Synonyms:
5-[2,5-bis(chloranyl)phenyl]-N-(2-chloranyl-6-methyl-phenyl)furan-2-carboxamide N-(2-chloro-6-methylphenyl)-5-(2,5-dichlorophenyl)-2-furancarboxamide SR-02000000250 cid_44607579
Type:
Small organic molecule
Emp. Form.:
C18H12Cl3NO2
Mol. Mass.:
380.652
SMILES:
Cc1cccc(Cl)c1NC(=O)c1ccc(o1)-c1cc(Cl)ccc1Cl
: