Target
Heat shock factor protein 1
Ligand
BDBM63301
Substrate
Meas. Tech.
Luminescence Cell-Based Dose Confimation HTS to Identify Inhibitors of Heat Shock Factor 1 (HSF1)
EC50
623±1070 nM
Citation
 PubChem, PC Luminescence Cell-Based Dose Confimation HTS to Identify Inhibitors of Heat Shock Factor 1 (HSF1) PubChem Bioassay (2010)[AID] 
Target
Name:
Heat shock factor protein 1
Synonyms:
HSF1_MOUSE Hsf1 protein
Type:
Enzyme Catalytic Domain
Mol. Mass.:
57208.68
Organism:
Mus musculus
Description:
P38532
Residue:
525
  
Inhibitor
Name:
BDBM63301
Synonyms:
1-(2,5-dimethyl-1-phenyl-3-pyrrolyl)-2-[(6-methyl-2-nitro-3-pyridinyl)oxy]ethanone 1-(2,5-dimethyl-1-phenyl-pyrrol-3-yl)-2-[(6-methyl-2-nitro-3-pyridyl)oxy]ethanone MLS000333959 cid_3599481
Type:
Small organic molecule
Emp. Form.:
C20H19N3O4
Mol. Mass.:
365.3826
SMILES:
Cc1cc(C(=O)COc2ccc(C)nc2[N+]([O-])=O)c(C)n1-c1ccccc1
: