Target
Heat shock factor protein 1
Ligand
BDBM63948
Substrate
Meas. Tech.
Luminescence Cell-Based Dose Confimation HTS to Identify Inhibitors of Heat Shock Factor 1 (HSF1)
EC50
476±1402 nM
Citation
 PubChem, PC Luminescence Cell-Based Dose Confimation HTS to Identify Inhibitors of Heat Shock Factor 1 (HSF1) PubChem Bioassay (2010)[AID] 
Target
Name:
Heat shock factor protein 1
Synonyms:
HSF1_MOUSE Hsf1 protein
Type:
Enzyme Catalytic Domain
Mol. Mass.:
57208.68
Organism:
Mus musculus
Description:
P38532
Residue:
525
  
Inhibitor
Name:
BDBM63948
Synonyms:
(E)-3-(2,5-dimethoxyanilino)-1-phenyl-2-propen-1-one (E)-3-(2,5-dimethoxyanilino)-1-phenylprop-2-en-1-one 3-[(2,5-dimethoxyphenyl)amino]-1-phenyl-2-propen-1-one SMR000497263 | cid_2291569
Type:
Small organic molecule
Emp. Form.:
C17H17NO3
Mol. Mass.:
283.3218
SMILES:
COc1ccc(OC)c(c1)N=CCC(=O)c1ccccc1
: