Target
Mu-type opioid receptor
Ligand
BDBM38902
Substrate
Meas. Tech.
Fluorescence-based biochemical high throughput dose response assay to identify inhibitors of Protein Phosphatase 1 (PP1)
IC50
6280±n/a nM
Citation
 PubChem, PC Fluorescence-based biochemical high throughput dose response assay to identify inhibitors of Protein Phosphatase 1 (PP1) PubChem Bioassay (2010)[AID] 
Target
Name:
Mu-type opioid receptor
Synonyms:
M-OR-1 MOR-1 MUOR1 Mu opiate receptor OPRM1 hMOP | mu-type opioid receptor isoform MOR-1
Type:
G Protein-Coupled Receptor (GPCR)
Mol. Mass.:
44789.51
Organism:
Homo sapiens (Human)
Description:
P35372
Residue:
400
  
Inhibitor
Name:
BDBM38902
Synonyms:
4-(4-phenyl-1-piperazinyl)-2-(2-pyridinyl)quinazoline 4-(4-phenylpiperazin-1-yl)-2-pyridin-2-ylquinazoline MLS000036745 cid_661691
Type:
Small organic molecule
Emp. Form.:
C23H21N5
Mol. Mass.:
367.4463
SMILES:
C1CN(CCN1c1ccccc1)c1nc(nc2ccccc12)-c1ccccn1
: