Target
Tumor necrosis factor
Ligand
BDBM36852
Substrate
Meas. Tech.
HTS dose response assay for identification of inhibitors of TNFa-specific NF-kB induction
IC50
4501±304.5 nM
Citation
 PubChem, PC HTS dose response assay for identification of inhibitors of TNFa-specific NF-kB induction PubChem Bioassay (2010)[AID] 
Target
Name:
Tumor necrosis factor
Synonyms:
Cachectin TNF-a TNFA TNFSF2 Tumor necrosis factor (TNFa) Tumor necrosis factor ligand superfamily member 2 Tumor necrosis factor, soluble form | tumor necrosis factor alpha
Type:
Enzyme
Mol. Mass.:
25645.11
Organism:
Homo sapiens (Human)
Description:
P01375
Residue:
233
  
Inhibitor
Name:
BDBM36852
Synonyms:
MLS000073104 N-[4-(1,3-benzodioxol-5-yl)-1,3-thiazol-2-yl]pyridine-4-carboxamide N-[4-(1,3-benzodioxol-5-yl)thiazol-2-yl]isonicotinamide cid_650651
Type:
Small organic molecule
Emp. Form.:
C16H11N3O3S
Mol. Mass.:
325.342
SMILES:
O=C(Nc1nc(cs1)-c1ccc2OCOc2c1)c1ccncc1
: