Target
DNA damage-inducible transcript 3 protein
Ligand
BDBM50507
Substrate
Meas. Tech.
Dose-response primary assay and counterscreen assay for HTS small molecule inhibitors of CHOP to regulate the unfolded protein response to ER stress
IC50
930±n/a nM
Citation
 PubChem, PC Dose-response primary assay and counterscreen assay for HTS small molecule inhibitors of CHOP to regulate the unfolded protein response to ER stress PubChem Bioassay (2010)[AID] 
Target
Name:
DNA damage-inducible transcript 3 protein
Synonyms:
Chop DDIT3_MOUSE Gadd153
Type:
Enzyme Catalytic Domain
Mol. Mass.:
19175.17
Organism:
Mus musculus
Description:
gi_160707929
Residue:
168
  
Inhibitor
Name:
BDBM50507
Synonyms:
1-(1,1-diketo-4-tosyl-2,5-dihydrothiophen-3-yl)ethanone 1-[4-(4-methylphenyl)sulfonyl-1,1-dioxo-2,5-dihydrothiophen-3-yl]ethanone MLS000694854 cid_1485939
Type:
Small organic molecule
Emp. Form.:
C13H14O5S2
Mol. Mass.:
314.377
SMILES:
CC(=O)C1=C(CS(=O)(=O)C1)S(=O)(=O)c1ccc(C)cc1
: