Target
Glycogen synthase kinase-3 beta
Ligand
BDBM41085
Substrate
Meas. Tech.
Luminescence Cell-Free Homogeneous Dose Retest to Identify Inhibitors of Glycogen Synthase Kinase-3 beta Activity
EC50
>300000±n/a nM
Citation
 PubChem, PC Luminescence Cell-Free Homogeneous Dose Retest to Identify Inhibitors of Glycogen Synthase Kinase-3 beta Activity PubChem Bioassay (2010)[AID] 
Target
Name:
Glycogen synthase kinase-3 beta
Synonyms:
GSK-3 beta GSK3B Glycogen synthase kinase 3 beta (GSK3B) Glycogen synthase kinase-3 beta (GSK-3B) Glycogen synthase kinase-3 beta (GSK3B) Glycogen synthase kinase-3beta (GSK3B) | Serine/threonine-protein kinase GSK3B
Type:
Enzyme
Mol. Mass.:
46756.38
Organism:
Homo sapiens (Human)
Description:
P49841
Residue:
420
  
Inhibitor
Name:
BDBM41085
Synonyms:
6-methyl-4-(4-morpholinoanilino)quinoline-3-carboxylic acid ethyl ester MLS000575705 cid_1190554 ethyl 6-methyl-4-[(4-morpholin-4-ylphenyl)amino]quinoline-3-carboxylate | ethyl 6-methyl-4-{[4-(4-morpholinyl)phenyl]amino}-3-quinolinecarboxylate
Type:
Small organic molecule
Emp. Form.:
C23H25N3O3
Mol. Mass.:
391.4629
SMILES:
CCOC(=O)c1cnc2ccc(C)cc2c1Nc1ccc(cc1)N1CCOCC1
: