Target
Amyloid-beta A4 precursor protein-binding family A member 1
Ligand
BDBM40727
Substrate
Meas. Tech.
SAR analysis of small molecule inhibitors of Mint-PDZ and N-type Ca2+ channel carboxyl-terminal peptide association using HTRF - Set 2
IC50
10900±n/a nM
Citation
 PubChem, PC SAR analysis of small molecule inhibitors of Mint-PDZ and N-type Ca2+ channel carboxyl-terminal peptide association using HTRF - Set 2 PubChem Bioassay (2010)[AID] 
Target
Name:
Amyloid-beta A4 precursor protein-binding family A member 1
Synonyms:
APBA1_RAT Mint1 neuronal munc18-1 binding protein
Type:
Enzyme Catalytic Domain
Mol. Mass.:
92603.32
Organism:
Rattus norvegicus
Description:
gi_2625023
Residue:
839
  
Inhibitor
Name:
BDBM40727
Synonyms:
MLS000537135 N-[(4-fluorobenzylidene)amino]-2-(2-furyl)cinchoninamide N-[(4-fluorophenyl)methylideneamino]-2-(furan-2-yl)quinoline-4-carboxamide cid_1226487
Type:
Small organic molecule
Emp. Form.:
C21H14FN3O2
Mol. Mass.:
359.3532
SMILES:
Fc1ccc(C=NNC(=O)c2cc(nc3ccccc23)-c2ccco2)cc1
: