Target
Heat shock factor protein 1
Ligand
BDBM64890
Substrate
Meas. Tech.
Luminescence Cell-Based Dose Retest to Identify Potentiators of Heat Shock Factor 1 (HSF1)
EC50
35820±n/a nM
Citation
 PubChem, PC Luminescence Cell-Based Dose Retest to Identify Potentiators of Heat Shock Factor 1 (HSF1) PubChem Bioassay (2010)[AID] 
Target
Name:
Heat shock factor protein 1
Synonyms:
HSF1_MOUSE Hsf1 protein
Type:
Enzyme Catalytic Domain
Mol. Mass.:
57208.68
Organism:
Mus musculus
Description:
P38532
Residue:
525
  
Inhibitor
Name:
BDBM64890
Synonyms:
(4-Benzyl-5-furan-2-yl-4H-[1,2,4]triazol-3-ylsulfanyl)-acetic acid cyclohexyl ester 2-[[5-(2-furanyl)-4-(phenylmethyl)-1,2,4-triazol-3-yl]thio]acetic acid cyclohexyl ester SMR000006149 cyclohexyl 2-[[4-benzyl-5-(furan-2-yl)-1,2,4-triazol-3-yl]sulfanyl]acetate | cyclohexyl 2-[[5-(furan-2-yl)-4-(phenylmethyl)-1,2,4-triazol-3-yl]sulfanyl]ethanoate
Type:
Small organic molecule
Emp. Form.:
C21H23N3O3S
Mol. Mass.:
397.491
SMILES:
O=C(CSc1nnc(-c2ccco2)n1Cc1ccccc1)OC1CCCCC1
: