Target
Eukaryotic translation initiation factor 4H
Ligand
BDBM48414
Substrate
Meas. Tech.
SAR analysis for the identification of translation initiation inhibitors (eIF4H)
IC50
6470±n/a nM
Citation
 PubChem, PC SAR analysis for the identification of translation initiation inhibitors (eIF4H) PubChem Bioassay (2010)[AID] 
Target
Name:
Eukaryotic translation initiation factor 4H
Synonyms:
EIF4H KIAA0038 WSCR1
Type:
Enzyme Catalytic Domain
Mol. Mass.:
27385.24
Organism:
Homo sapiens (Human)
Description:
Q15056
Residue:
248
  
Inhibitor
Name:
BDBM48414
Synonyms:
4-[[3-keto-2-(4-methoxyphenyl)isoindoline-4-carbonyl]amino]piperidine-1-carboxylic acid ethyl ester MLS000117133 cid_5307705 ethyl 4-[[2-(4-methoxyphenyl)-3-oxo-1H-isoindole-4-carbonyl]amino]piperidine-1-carboxylate
Type:
Small organic molecule
Emp. Form.:
C24H27N3O5
Mol. Mass.:
437.4883
SMILES:
CCOC(=O)N1CCC(CC1)NC(=O)c1cccc2CN(C(=O)c12)c1ccc(OC)cc1
: