Target
Eukaryotic translation initiation factor 4H
Ligand
BDBM54943
Substrate
Meas. Tech.
SAR analysis for the identification of translation initiation inhibitors (eIF4H)
IC50
7280±n/a nM
Citation
 PubChem, PC SAR analysis for the identification of translation initiation inhibitors (eIF4H) PubChem Bioassay (2010)[AID] 
Target
Name:
Eukaryotic translation initiation factor 4H
Synonyms:
EIF4H KIAA0038 WSCR1
Type:
Enzyme Catalytic Domain
Mol. Mass.:
27385.24
Organism:
Homo sapiens (Human)
Description:
Q15056
Residue:
248
  
Inhibitor
Name:
BDBM54943
Synonyms:
4-[[2-[(Z)-[1-[2-(2-methylanilino)-2-oxoethyl]-2,5-dioxo-4-imidazolidinylidene]methyl]phenoxy]methyl]benzoic acid 4-[[2-[(Z)-[1-[2-[(2-methylphenyl)amino]-2-oxidanylidene-ethyl]-2,5-bis(oxidanylidene)imidazolidin-4-ylidene]methyl]phenoxy]methyl]benzoic acid MLS000947932 cid_5989040
Type:
Small organic molecule
Emp. Form.:
C27H23N3O6
Mol. Mass.:
485.488
SMILES:
Cc1ccccc1NC(=O)CN1C(=O)N\C(=C/c2ccccc2OCc2ccc(cc2)C(O)=O)C1=O
: