Target
Protein LANA1
Ligand
BDBM73574
Substrate
Meas. Tech.
Fluorescence Polarization Cell-Free Homogeneous Dose Retest to Confirm Inhibitors of the LANA Histone H2A/H2B Interaction
EC50
>75000±n/a nM
Citation
 PubChem, PC Fluorescence Polarization Cell-Free Homogeneous Dose Retest to Confirm Inhibitors of the LANA Histone H2A/H2B Interaction PubChem Bioassay (2010)[AID] 
Target
Name:
Protein LANA1
Synonyms:
LANA LANA1_HHV8P
Type:
Enzyme Catalytic Domain
Mol. Mass.:
131093.36
Organism:
Human herpesvirus 8
Description:
Q9QR71
Residue:
1129
  
Inhibitor
Name:
BDBM73574
Synonyms:
2-[2-[[3-(trifluoromethyl)benzyl]carbamoyl]phenyl]benzoic acid 2-[2-[oxo-[[3-(trifluoromethyl)phenyl]methylamino]methyl]phenyl]benzoic acid SMR000277877 | cid_1431346
Type:
Small organic molecule
Emp. Form.:
C22H16F3NO3
Mol. Mass.:
399.3625
SMILES:
OC(=O)c1ccccc1-c1ccccc1C(=O)NCc1cccc(c1)C(F)(F)F
: