Target
Protein LANA1
Ligand
BDBM74256
Substrate
Meas. Tech.
Fluorescence Polarization Cell-Free Homogeneous Dose Retest to Confirm Inhibitors of the LANA Histone H2A/H2B Interaction
EC50
>75000±n/a nM
Citation
 PubChem, PC Fluorescence Polarization Cell-Free Homogeneous Dose Retest to Confirm Inhibitors of the LANA Histone H2A/H2B Interaction PubChem Bioassay (2010)[AID] 
Target
Name:
Protein LANA1
Synonyms:
LANA LANA1_HHV8P
Type:
Enzyme Catalytic Domain
Mol. Mass.:
131093.36
Organism:
Human herpesvirus 8
Description:
Q9QR71
Residue:
1129
  
Inhibitor
Name:
BDBM74256
Synonyms:
EN300-17273 N-cyclohexylcyclohexanamine cid_7582 | dicyclohexylamine
Type:
Small organic molecule
Emp. Form.:
C12H23N
Mol. Mass.:
181.3177
SMILES:
C1CCC(CC1)NC1CCCCC1
: