Target
Importin subunit alpha-1
Ligand
BDBM74773
Substrate
Meas. Tech.
Fluorescence Cell-Free Homogeneous Counterscreen to Identify Inhibitors of the RanGTP-Importin-beta complex.
EC50
5569±n/a nM
Citation
 PubChem, PC Fluorescence Cell-Free Homogeneous Counterscreen to Identify Inhibitors of the RanGTP-Importin-beta complex. PubChem Bioassay (2010)[AID] 
Target
Name:
Importin subunit alpha-1
Synonyms:
IMA1_HUMAN RCH1 karyopherin alpha 2 (RAG cohort 1, importin alpha 1), isoform CRA_b
Type:
Enzyme Catalytic Domain
Mol. Mass.:
57852.15
Organism:
Homo sapiens (Human)
Description:
gi_119609447
Residue:
529
  
Inhibitor
Name:
BDBM74773
Synonyms:
2-(allylamino)-4-amino-5-(5-bromothiophene-2-carbonyl)thiophene-3-carbonitrile 4-amino-5-(5-bromothiophene-2-carbonyl)-2-(prop-2-enylamino)thiophene-3-carbonitrile 4-azanyl-5-(5-bromanylthiophen-2-yl)carbonyl-2-(prop-2-enylamino)thiophene-3-carbonitrile SMR000143670 | cid_1893291
Type:
Small organic molecule
Emp. Form.:
C13H10BrN3OS2
Mol. Mass.:
368.272
SMILES:
Nc1c(sc(NCC=C)c1C#N)C(=O)c1ccc(Br)s1
: