Target
Importin subunit alpha-1
Ligand
BDBM74990
Substrate
Meas. Tech.
Fluorescence Cell-Free Homogeneous Counterscreen to Identify Inhibitors of the RanGTP-Importin-beta complex.
EC50
>500000±n/a nM
Citation
 PubChem, PC Fluorescence Cell-Free Homogeneous Counterscreen to Identify Inhibitors of the RanGTP-Importin-beta complex. PubChem Bioassay (2010)[AID] 
Target
Name:
Importin subunit alpha-1
Synonyms:
IMA1_HUMAN RCH1 karyopherin alpha 2 (RAG cohort 1, importin alpha 1), isoform CRA_b
Type:
Enzyme Catalytic Domain
Mol. Mass.:
57852.15
Organism:
Homo sapiens (Human)
Description:
gi_119609447
Residue:
529
  
Inhibitor
Name:
BDBM74990
Synonyms:
4-chloranyl-N-ethyl-N-(2-methylphenyl)-2-nitro-benzamide 4-chloro-N-ethyl-N-(2-methylphenyl)-2-nitrobenzamide SMR000281355 | cid_584243
Type:
Small organic molecule
Emp. Form.:
C16H15ClN2O3
Mol. Mass.:
318.755
SMILES:
CCN(C(=O)c1ccc(Cl)cc1[N+]([O-])=O)c1ccccc1C
: