Target
Importin subunit alpha-1
Ligand
BDBM75219
Substrate
Meas. Tech.
Fluorescence Cell-Free Homogeneous Counterscreen to Identify Inhibitors of the RanGTP-Importin-beta complex.
EC50
>500000±n/a nM
Citation
 PubChem, PC Fluorescence Cell-Free Homogeneous Counterscreen to Identify Inhibitors of the RanGTP-Importin-beta complex. PubChem Bioassay (2010)[AID] 
Target
Name:
Importin subunit alpha-1
Synonyms:
IMA1_HUMAN RCH1 karyopherin alpha 2 (RAG cohort 1, importin alpha 1), isoform CRA_b
Type:
Enzyme Catalytic Domain
Mol. Mass.:
57852.15
Organism:
Homo sapiens (Human)
Description:
gi_119609447
Residue:
529
  
Inhibitor
Name:
BDBM75219
Synonyms:
2-(cyclohexanecarbonylamino)-6-ethyl-5,7-dihydro-4H-thieno[2,3-c]pyridine-3-carboxylic acid methyl ester;hydrochloride MLS001066665 cid_24761873 methyl 2-(cyclohexylcarbonylamino)-6-ethyl-5,7-dihydro-4H-thieno[2,3-c]pyridine-3-carboxylate;hydrochloride
Type:
Small organic molecule
Emp. Form.:
C18H26N2O3S
Mol. Mass.:
350.476
SMILES:
CCN1CCc2c(C1)sc(NC(=O)C1CCCCC1)c2C(=O)OC
: