Target
Aryl hydrocarbon receptor
Ligand
BDBM75509
Substrate
Meas. Tech.
Luminescence-based cell-based high throughput dose response assay for activators of the Aryl Hydrocarbon Receptor (AHR)
EC50
1443±n/a nM
Citation
 PubChem, PC Luminescence-based cell-based high throughput dose response assay for activators of the Aryl Hydrocarbon Receptor (AHR) PubChem Bioassay (2010)[AID] 
Target
Name:
Aryl hydrocarbon receptor
Synonyms:
AHR BHLHE76 aryl hydrocarbon receptor precursor
Type:
PROTEIN
Mol. Mass.:
96143.77
Organism:
Homo sapiens (Human)
Description:
ChEMBL_1503828
Residue:
848
  
Inhibitor
Name:
BDBM75509
Synonyms:
1-[(5-methyl-2-thienyl)methyleneamino]-4-phenyl-4-imidazoline-2-thione 3-[(5-methylthiophen-2-yl)methylideneamino]-5-phenyl-1H-imidazole-2-thione SMR000376471 | cid_2109460
Type:
Small organic molecule
Emp. Form.:
C15H13N3S2
Mol. Mass.:
299.414
SMILES:
Cc1ccc(C=Nn2cc([nH]c2=S)-c2ccccc2)s1
: