Target
Type-1 angiotensin II receptor
Ligand
BDBM58188
Substrate
Meas. Tech.
Dose Response screen for antagonists of Angiotensin II Receptor Type 1 to assess selectivity of uHTS small molecule antagonists hits of the APJ receptor
IC50
3812±594 nM
Citation
 PubChem, PC Dose Response screen for antagonists of Angiotensin II Receptor Type 1 to assess selectivity of uHTS small molecule antagonists hits of the APJ receptor PubChem Bioassay (2010)[AID] 
Target
Name:
Type-1 angiotensin II receptor
Synonyms:
AGTR1 AGTR1B AT1 AT1BR AT2R1B Angiotensin II receptor Type-1 angiotensin II receptor (AT1)
Type:
Protein
Mol. Mass.:
41080.75
Organism:
Homo sapiens (Human)
Description:
P30556
Residue:
359
  
Inhibitor
Name:
BDBM58188
Synonyms:
1-benzyl-3-(tert-butyl)-N'-(4-methylphenyl)-1H-pyrazole-5-carbohydrazide 2-benzyl-5-tert-butyl-N'-(p-tolyl)pyrazole-3-carbohydrazide 5-tert-butyl-N'-(4-methylphenyl)-2-(phenylmethyl)pyrazole-3-carbohydrazide SMR000458415 | cid_2812498
Type:
Small organic molecule
Emp. Form.:
C22H26N4O
Mol. Mass.:
362.468
SMILES:
Cc1ccc(NNC(=O)c2cc(nn2Cc2ccccc2)C(C)(C)C)cc1
: