Target
Insulin-degrading enzyme
Ligand
BDBM75790
Substrate
Meas. Tech.
Dose Response: Fluorescence polarization-based cell-based high throughput dose response assay for inhibitors of insulin-degrading enzyme (IDE)
IC50
>6215±n/a nM
Citation
 PubChem, PC Dose Response: Fluorescence polarization-based cell-based high throughput dose response assay for inhibitors of insulin-degrading enzyme (IDE) PubChem Bioassay (2010)[AID] 
Target
Name:
Insulin-degrading enzyme
Synonyms:
Abeta-degrading protease IDE Insulin degrading enzyme (hIDE) Insulin-degrading enzyme Insulysin | insulin-degrading enzyme isoform 1 precursor
Type:
Enzyme Catalytic Domain
Mol. Mass.:
117968.59
Organism:
Homo sapiens (Human)
Description:
P14735
Residue:
1019
  
Inhibitor
Name:
BDBM75790
Synonyms:
3-[(4-hydroxy-3-methoxybenzylidene)amino]-2-thioxo-1,3-thiazolidin-4-one 3-[[(E)-(3-methoxy-4-oxo-1-cyclohexa-2,5-dienylidene)methyl]amino]-2-sulfanylidene-4-thiazolidinone 3-[[(E)-(4-keto-3-methoxy-cyclohexa-2,5-dien-1-ylidene)methyl]amino]-2-thioxo-thiazolidin-4-one SMR000135418 | cid_5342649
Type:
Small organic molecule
Emp. Form.:
C11H10N2O3S2
Mol. Mass.:
282.339
SMILES:
COc1cc(C=Nn2c(O)csc2=S)ccc1O
: