Target
Insulin-degrading enzyme
Ligand
BDBM75804
Substrate
Meas. Tech.
Dose Response: Fluorescence polarization-based cell-based high throughput dose response assay for inhibitors of insulin-degrading enzyme (IDE)
IC50
>6215±n/a nM
Citation
 PubChem, PC Dose Response: Fluorescence polarization-based cell-based high throughput dose response assay for inhibitors of insulin-degrading enzyme (IDE) PubChem Bioassay (2010)[AID] 
Target
Name:
Insulin-degrading enzyme
Synonyms:
Abeta-degrading protease IDE Insulin degrading enzyme (hIDE) Insulin-degrading enzyme Insulysin | insulin-degrading enzyme isoform 1 precursor
Type:
Enzyme Catalytic Domain
Mol. Mass.:
117968.59
Organism:
Homo sapiens (Human)
Description:
P14735
Residue:
1019
  
Inhibitor
Name:
BDBM75804
Synonyms:
(5Z)-2-(p-anisidino)-5-vanillylidene-2-thiazolin-4-one (5Z)-5-[(4-hydroxy-3-methoxyphenyl)methylidene]-2-(4-methoxyanilino)-1,3-thiazol-4-one 5-[1-(4-Hydroxy-3-methoxy-phenyl)-meth-(Z)-ylidene]-2-(4-methoxy-phenylamino)-thiazol-4-one SMR000219349 | cid_1839201
Type:
Small organic molecule
Emp. Form.:
C18H16N2O4S
Mol. Mass.:
356.396
SMILES:
COc1ccc(NC2=NC(=O)C(S2)=Cc2ccc(O)c(OC)c2)cc1
: